{"text_format":"3","workbook":"xlsx","n_sheets":2,"sheets":["Refusjoner","Lagliste"],"not_rendered":{"defined_names":1},"read":"whole","date_system":"1900"}

{"sheet":"Refusjoner","index":0,"n_rows":33,"n_cols":7,"rows_kept":33,"merged":[[0,1,0,6],[2,1,10,6],[12,1,12,2],[12,3,12,6],[13,1,13,2],[13,3,13,6],[14,1,14,2],[14,3,14,6],[15,1,15,2],[15,3,15,6],[18,1,18,6],[21,2,21,5],[22,2,22,5],[23,2,23,5],[24,2,24,5],[25,2,25,5],[26,2,26,5],[27,2,27,5],[28,2,28,5],[29,2,29,5],[30,2,30,5],[33,1,33,6]]}
[null,"Refusjon av utlegg - ETF Håndball"]
[]
[null,"Utgifter til påmeldinger, sosiale tiltak etc kan refunderes fra lagkonto\nUtgifter til utstyr, drakter etc skal normalt bestilles via materialforvalter.\n\nSlik brukes skjemaet:\n1. Velg lag ved å klikke nedtrekksmeny i det gule feltet. Velg ETF Håndball hvis det ikke er for et spesifikt lag\n2. Skriv inn navnet til den som skal ha penger tilbake i oransje felt\n3. Legg inn dato, skriv hva som har blitt kjøpt/betalt og sum (gjerne flere linjer) \n4. Kvittering skal skannes inn/tas bilde av og legges ved\n5. Skriv inn kontonummer som pengene skal overføres til i blått felt.\n6. Lagre en kopi av regnearket med datoen i filnavn, og send dette til kasserer.etfhandball@klubbkontor no.\n7. Disponenter av lagkontoer legger inn refusjonen til utbetaling i nettbanken. Filnavnet på filen som er sendt på mail og datoen for innsending noteres i betalingsinfo.\n"]
{"$rows_empty":9}
[null,"Lag",null,"J 2007"]
[null,"Konto",null,{"$f":"IFERROR(VLOOKUP(D13,Lagliste!A2:D15,2,FALSE),\"-\")","v":"2050.42.60543"}]
[null,"Disponent",null,{"$f":"IFERROR(VLOOKUP(D13,Table1[],3,0),\"-\")","v":"Gunner Kommisrud"}]
[null,"Disponent 2",null,{"$f":"IFERROR(VLOOKUP(D13,Table1[],4,0),\"-\")","v":"Kasserer"}]
[]
[null,"Refusjon til (navn):"]
[]
[]
[]
[null,"Dato","Hva",{"$nulls":3},"Sum"]
{"$rows_empty":8}
[null,"Total",{"$nulls":4},{"$f":"SUM(G23:G30)","v":0}]
[]
[null,"Utbetales konto:"]

{"sheet":"Lagliste","index":1,"n_rows":15,"n_cols":4,"rows_kept":15,"hidden":true}
["Lag","Konto","Kontodisponent 1","Kontodisponent 2"]
[]
["ETF Håndball","2050.33.07791","Kasserer","Leder"]
["Håndballskolen","2050.42.60470","Gunner Kommisrud","Kasserer"]
["J/G 2012","2050.42.60497","Rita Andersson","Kasserer"]
["J 2011","2050.42.60519","Eirik Haakstad","Kasserer"]
["J 2010","2050.42.60527","Lisbeth Dønum","Kasserer"]
["J 2008/09","2050.42.60535","Øystein Snekkerhaugen","Kasserer"]
["J 2007","2050.42.60543","Gunner Kommisrud","Kasserer"]
["J 2006","2050.42.60551","Øystein Snekkerhaugen","Kasserer"]
["J 2004/05","2050.42.60578","Monica Rytter","Kasserer"]
["J 2003","2050.42.60586","Bente Sandholt","Kasserer"]
["G 2010/11","2050.42.60608","Veronica Corbet","Kasserer"]
["G 2008","2050.42.60616","Marianne Myrvoll Snilsberg","Kasserer"]
["K Senior","2050.42.60624","Veronica Corbet","Kasserer"]